Target
Bromodomain-containing protein 4 [1-477]
Ligand
BDBM445581
Substrate
Meas. Tech.
Time Resolved Fluorescence Resonance Energy Transfer (TR-FRET) Assay
IC50
<1500±n/a nM
Citation
 Quesnelle, CAHarikrishnan, LSHill, MD Tricyclic compounds as anticancer agents US Patent  US10683290 Publication Date 6/16/2020 
Target
Name:
Bromodomain-containing protein 4 [1-477]
Synonyms:
BRD4 Bromodomain-containing protein 4 (BRD4)(1-477) | HUNK1
Type:
Enzyme Catalytic Domain
Mol. Mass.:
52863.68
Organism:
Homo sapiens (Human)
Description:
O60885[1-477]
Residue:
475
  
Inhibitor
Name:
BDBM445581
Synonyms:
US10683290, Example 74
Type:
Small organic molecule
Emp. Form.:
C28H32N6O3
Mol. Mass.:
500.5921
SMILES:
Cc1cc(no1)[C@H](C1CCOCC1)n1c2cc(ccc2c2ncc(cc12)C(C)(C)O)-c1c(C)nnn1C
: