Target
C5a anaphylatoxin chemotactic receptor 1
Ligand
BDBM445627
Substrate
Meas. Tech.
Inhibition Ligand Binding Assay
IC50
<5±n/a nM
Citation
 Fan, PLange, CWLui, RMMalathong, VMali, VRPunna, SZeng, YZhang, P 5-5 fused rings as C5a inhibitors US Patent  US10683294 Publication Date 6/16/2020 
Target
Name:
C5a anaphylatoxin chemotactic receptor 1
Synonyms:
C5AR C5AR1_HUMAN C5a anaphylatoxin chemotactic receptor C5a-R | CD_antigen=CD88
Type:
Enzyme
Mol. Mass.:
39347.68
Organism:
Homo sapiens (Human)
Description:
P21730
Residue:
350
  
Inhibitor
Name:
BDBM445627
Synonyms:
US10683294, Compound 1.032 | US11479553, Compound 1.009
Type:
Small organic molecule
Emp. Form.:
C30H37FN4
Mol. Mass.:
472.64
SMILES:
CCc1cccc(CC)c1-n1nc2c(CN(CC(C)(C)C)C2(C)C)c1-c1ccc(F)c2[nH]ccc12
: