Target
C5a anaphylatoxin chemotactic receptor 1
Ligand
BDBM445643
Substrate
Meas. Tech.
Inhibition Ligand Binding Assay
IC50
27.5±n/a nM
Citation
 Fan, PLange, CWLui, RMMalathong, VMali, VRPunna, SZeng, YZhang, P 5-5 fused rings as C5a inhibitors US Patent  US10683294 Publication Date 6/16/2020 
Target
Name:
C5a anaphylatoxin chemotactic receptor 1
Synonyms:
C5AR C5AR1_HUMAN C5a anaphylatoxin chemotactic receptor C5a-R | CD_antigen=CD88
Type:
Enzyme
Mol. Mass.:
39347.68
Organism:
Homo sapiens (Human)
Description:
P21730
Residue:
350
  
Inhibitor
Name:
BDBM445643
Synonyms:
US10683294, Compound 1.048 | US11479553, Compound 1.048
Type:
Small organic molecule
Emp. Form.:
C30H36N4O2
Mol. Mass.:
484.6324
SMILES:
CCc1cccc(CC)c1-n1nc2c(CN(C(=O)OC(C)(C)C)C2(C)C)c1-c1ccc2[nH]ccc2c1
: