Target
Neuromedin-K receptor
Ligand
BDBM251909
Substrate
Meas. Tech.
Competitive Binding Assay
Ki
4.00±n/a nM
Citation
 Hoveyda, HRDutheuil, GFraser, GLRoy, MBousmaqui, MEBatt, F Chiral N-acyl-5,6,7(8-substituted)-tetrahydro-[1,2,4]triazolo[4,3-A]pyrazines as selective NK-3 receptor antagonists, pharmaceutical composition, methods for use in NK-3 receptor mediated disorders and chiral synthesis thereof US Patent  US10683295 Publication Date 6/16/2020 
Target
Name:
Neuromedin-K receptor
Synonyms:
NK-3 receptor NK3R NKR Neurokinin B receptor Neuromedin-3 receptor (NK-3R) Neuromedin-K receptor Neuromedin-K receptor (NK3) TAC3R Tachykinin receptor 3 | Tachykinin receptor 3 (NK3)
Type:
Enzyme
Mol. Mass.:
52221.96
Organism:
Homo sapiens (Human)
Description:
P29371
Residue:
465
  
Inhibitor
Name:
BDBM251909
Synonyms:
US10065961, Compound 7 US10941151, Compound 7 | US9475814, 7
Type:
Small organic molecule
Emp. Form.:
C22H19N5OS2
Mol. Mass.:
433.549
SMILES:
C[C@H]1N(CCn2c1nnc2-c1csc(C=C)n1)C(=O)c1ccc(cc1)-c1cccs1
: