Target
Substance-P receptor
Ligand
BDBM50081195
Substrate
Meas. Tech.
Binding Assay
Ki
12700±n/a nM
Citation
 Hoveyda, HRDutheuil, GFraser, GLRoy, MBousmaqui, MEBatt, F Chiral N-acyl-5,6,7(8-substituted)-tetrahydro-[1,2,4]triazolo[4,3-A]pyrazines as selective NK-3 receptor antagonists, pharmaceutical composition, methods for use in NK-3 receptor mediated disorders and chiral synthesis thereof US Patent  US10683295 Publication Date 6/16/2020 
Target
Name:
Substance-P receptor
Synonyms:
NK-1 receptor NK1 Receptor NK1R_HUMAN Neurokinin-1 (NK-1) SPR TACR1 Tachykinin receptor 1 (NK1) | tachykinin
Type:
G Protein-Coupled Receptor (GPCR)
Mol. Mass.:
46254.43
Organism:
Homo sapiens (Human)
Description:
P25103
Residue:
407
  
Inhibitor
Name:
BDBM50081195
Synonyms:
CHEMBL3422010 US10683295, Compound 1 US9475814, 1
Type:
Small organic molecule
Emp. Form.:
C21H19N5OS2
Mol. Mass.:
421.538
SMILES:
C[C@H]1N(CCn2c1nnc2-c1csc(C)n1)C(=O)c1ccc(cc1)-c1cccs1
: