Target
Tryptophan 5-hydroxylase 1
Ligand
BDBM445669
Substrate
Meas. Tech.
In Vitro Enzyme Activity Assay
IC50
177±33 nM
Citation
 Bader, MSpecker, EMatthes, SSchütz, AMallow, KGrohmann, MNazaré, M Xanthine derivatives, their use as a medicament, and pharmaceutical preparations comprising the same US Patent  US10683309 Publication Date 6/16/2020 
Target
Name:
Tryptophan 5-hydroxylase 1
Synonyms:
TPH TPH1_HUMAN TRPH | Tryptophan 5-monooxygenase 1
Type:
PROTEIN
Mol. Mass.:
50990.64
Organism:
Homo sapiens (Human)
Description:
ChEMBL_1361824
Residue:
444
  
Inhibitor
Name:
BDBM445669
Synonyms:
Ex. 7/KM-06-81/(I-7) US11028104, Example 7
Type:
Small organic molecule
Emp. Form.:
C26H24N8O2
Mol. Mass.:
480.5212
SMILES:
CCn1c2nc(Cc3cn4ccccc4n3)n(Cc3ccc(cc3)-c3ccn(C)n3)c2c(=O)[nH]c1=O
: