Target
Tryptophan 5-hydroxylase 1
Ligand
BDBM445676
Substrate
Meas. Tech.
In Vitro Enzyme Activity Assay
IC50
68.0±8 nM
Citation
 Bader, MSpecker, EMatthes, SSchütz, AMallow, KGrohmann, MNazaré, M Xanthine derivatives, their use as a medicament, and pharmaceutical preparations comprising the same US Patent  US10683309 Publication Date 6/16/2020 
Target
Name:
Tryptophan 5-hydroxylase 1
Synonyms:
TPH TPH1_HUMAN TRPH | Tryptophan 5-monooxygenase 1
Type:
PROTEIN
Mol. Mass.:
50990.64
Organism:
Homo sapiens (Human)
Description:
ChEMBL_1361824
Residue:
444
  
Inhibitor
Name:
BDBM445676
Synonyms:
Ex. 14/KM-06-64/(I-14) US11028104, Example 14
Type:
Small organic molecule
Emp. Form.:
C20H18N6O2S
Mol. Mass.:
406.461
SMILES:
CCn1c2nc(Cc3cn4ccsc4n3)n(Cc3ccccc3)c2c(=O)[nH]c1=O
: