Target
Tryptophan 5-hydroxylase 2
Ligand
BDBM445677
Substrate
Meas. Tech.
In Vitro Enzyme Activity Assay
IC50
14.0±3 nM
Citation
 Bader, MSpecker, EMatthes, SSchütz, AMallow, KGrohmann, MNazaré, M Xanthine derivatives, their use as a medicament, and pharmaceutical preparations comprising the same US Patent  US10683309 Publication Date 6/16/2020 
Target
Name:
Tryptophan 5-hydroxylase 2
Synonyms:
NTPH TPH2_HUMAN
Type:
PROTEIN
Mol. Mass.:
56055.12
Organism:
Homo sapiens (Human)
Description:
ChEMBL_487490
Residue:
490
  
Inhibitor
Name:
BDBM445677
Synonyms:
Ex. 15/KM-06-96/(I-15) US11028104, Example 15
Type:
Small organic molecule
Emp. Form.:
C24H22N8O2S
Mol. Mass.:
486.549
SMILES:
CCn1c2nc(Cc3cn4ccsc4n3)n(Cc3ccc(cc3)-c3ccn(C)n3)c2c(=O)[nH]c1=O
: