Target
Tryptophan 5-hydroxylase 2
Ligand
BDBM445697
Substrate
Meas. Tech.
In Vitro Enzyme Activity Assay
IC50
29.0±3 nM
Citation
 Bader, MSpecker, EMatthes, SSchütz, AMallow, KGrohmann, MNazaré, M Xanthine derivatives, their use as a medicament, and pharmaceutical preparations comprising the same US Patent  US10683309 Publication Date 6/16/2020 
Target
Name:
Tryptophan 5-hydroxylase 2
Synonyms:
NTPH TPH2_HUMAN
Type:
PROTEIN
Mol. Mass.:
56055.12
Organism:
Homo sapiens (Human)
Description:
ChEMBL_487490
Residue:
490
  
Inhibitor
Name:
BDBM445697
Synonyms:
Ex. 33/KM-06-156/(I-33) US11028104, Example 33
Type:
Small organic molecule
Emp. Form.:
C25H26N8O2
Mol. Mass.:
470.5263
SMILES:
CCn1c2nc(Cc3cn4CCCCc4n3)n(Cc3ccc(cc3)-n3ccnc3)c2c(=O)[nH]c1=O
: