Target
Proto-oncogene Wnt-1
Ligand
BDBM445771
Substrate
Meas. Tech.
Wnt activity assay
IC50
41.0±n/a nM
Citation
 Hood, JKumar KC, SWallace, DMMittapalli, GKHofilena, BJMak, CCBollu, VEastman, B 5-substituted indazole-3-carboxamides and preparation and use thereof US Patent  US10669240 Publication Date 6/2/2020 
Target
Name:
Proto-oncogene Wnt-1
Synonyms:
INT1 WNT1 | WNT1_HUMAN
Type:
Enzyme Catalytic Domain
Mol. Mass.:
41006.01
Organism:
Homo sapiens (human)
Description:
P04628
Residue:
370
  
Inhibitor
Name:
BDBM445771
Synonyms:
US10669240, Compound 67
Type:
Small organic molecule
Emp. Form.:
C27H30N6O2
Mol. Mass.:
470.5661
SMILES:
CC(C)Oc1ccc(NC(=O)c2n[nH]c3ccc(cc23)-c2cncc(CN3CCCCC3)c2)cn1
: