Target
Dipeptidyl peptidase 1
Ligand
BDBM385057
Substrate
Meas. Tech.
Fluorescence Assay for Recombinant Human (RH) DPP1
IC50
6.31±n/a nM
Citation
 Lonn, HRConnolly, SSwallow, SKarlsson, SPAurell, CPontén, JFDoyle, KJVan De Poël, AJJones, GPWatson, DWMacritchie, JAPalmer, NJ Certain (2S)-N-[(1S)-1-cyano-2-phenylethyl]-1,4-oxazepane-2-carboxamides dipeptidyl peptidase 1 inhibitors US Patent  US10669245 Publication Date 6/2/2020 
Target
Name:
Dipeptidyl peptidase 1
Synonyms:
CATC_HUMAN CTSC Cathepsin J Dipeptidyl peptidase 1 (DPPI) Dipeptidyl peptidase I (DPPI)
Type:
Enzyme
Mol. Mass.:
51857.28
Organism:
Homo sapiens (Human)
Description:
P53634
Residue:
463
  
Inhibitor
Name:
BDBM385057
Synonyms:
(2S)-N-[(1S)-1-Cyano-2-{4-[3-(cyclopropylmethyl)-2-oxo-2,3-dihydro-1,3-benzoxazol- 5-yl]phenyl}ethyl]-1,4-oxazepane-2-carboxamide US10669245, Example 17 US11655221, Example 17 US11680049, Example 17 | US20230278969, Example 17
Type:
Small organic molecule
Emp. Form.:
C26H28N4O4
Mol. Mass.:
460.5249
SMILES:
O=C(N[C@@H](Cc1ccc(cc1)-c1ccc2oc(=O)n(CC3CC3)c2c1)C#N)[C@@H]1CNCCCO1
: