Target
Dipeptidyl peptidase 1
Ligand
BDBM385068
Substrate
Meas. Tech.
Fluorescence Assay for Recombinant Human (RH) DPP1
IC50
8.13±n/a nM
Citation
 Lonn, HRConnolly, SSwallow, SKarlsson, SPAurell, CPontén, JFDoyle, KJVan De Poël, AJJones, GPWatson, DWMacritchie, JAPalmer, NJ Certain (2S)-N-[(1S)-1-cyano-2-phenylethyl]-1,4-oxazepane-2-carboxamides dipeptidyl peptidase 1 inhibitors US Patent  US10669245 Publication Date 6/2/2020 
Target
Name:
Dipeptidyl peptidase 1
Synonyms:
CATC_HUMAN CTSC Cathepsin J Dipeptidyl peptidase 1 (DPPI) Dipeptidyl peptidase I (DPPI)
Type:
Enzyme
Mol. Mass.:
51857.28
Organism:
Homo sapiens (Human)
Description:
P53634
Residue:
463
  
Inhibitor
Name:
BDBM385068
Synonyms:
(2S)-N-[(1S)-1-Cyano-2-{4-[2-oxo-3-(2,2,2-trifluoroethyl)-2,3-dihydro-1,3- benzoxazol-5-yl]phenyl}ethyl]-1,4-oxazepane-2-carboxamide US10669245, Example 28 US11655221, Example 28 US11680049, Example 28 | US20230278969, Example 28
Type:
Small organic molecule
Emp. Form.:
C24H23F3N4O4
Mol. Mass.:
488.459
SMILES:
FC(F)(F)Cn1c2cc(ccc2oc1=O)-c1ccc(C[C@H](NC(=O)[C@@H]2CNCCCO2)C#N)cc1
: