Target
Tyrosine-protein kinase ABL1
Ligand
BDBM446048
Substrate
Meas. Tech.
c-abl Kinase Assay
IC50
103±n/a nM
Citation
 Lee, JJo, SLee, GLim, KPark, AYLi, WFan, M Benzothiazol compounds and methods using the same for treating neurodegenerative disorders US Patent  US10669246 Publication Date 6/2/2020 
Target
Name:
Tyrosine-protein kinase ABL1
Synonyms:
ABL ABL1_HUMAN JTK7 Proto-oncogene tyrosine-protein kinase ABL1 Tyrosine-protein kinase ABL V-abl Abelson murine leukemia viral oncogene homolog 1 p150 | tyrosine-protein kinase ABL1 isoform a
Type:
Enzyme
Mol. Mass.:
122897.30
Organism:
Homo sapiens (Human)
Description:
P00519
Residue:
1130
  
Inhibitor
Name:
BDBM446048
Synonyms:
US10669246, Example 99 | US10968188, Example 99
Type:
Small organic molecule
Emp. Form.:
C19H14FN3O2S2
Mol. Mass.:
399.462
SMILES:
Cc1c(ccc2sc(=O)[nH]c12)-c1ccc2nc(NC(=O)[C@@H]3C[C@@H]3F)sc2c1
: