Target
Tyrosine-protein kinase ABL1
Ligand
BDBM446050
Substrate
Meas. Tech.
c-abl Kinase Assay
IC50
3.20±n/a nM
Citation
 Lee, JJo, SLee, GLim, KPark, AYLi, WFan, M Benzothiazol compounds and methods using the same for treating neurodegenerative disorders US Patent  US10669246 Publication Date 6/2/2020 
Target
Name:
Tyrosine-protein kinase ABL1
Synonyms:
ABL ABL1_HUMAN JTK7 Proto-oncogene tyrosine-protein kinase ABL1 Tyrosine-protein kinase ABL V-abl Abelson murine leukemia viral oncogene homolog 1 p150 | tyrosine-protein kinase ABL1 isoform a
Type:
Enzyme
Mol. Mass.:
122897.30
Organism:
Homo sapiens (Human)
Description:
P00519
Residue:
1130
  
Inhibitor
Name:
BDBM446050
Synonyms:
US10669246, Example 101 | US10968188, Example 101
Type:
Small organic molecule
Emp. Form.:
C18H13FN4OS
Mol. Mass.:
352.385
SMILES:
F[C@H]1CC1C(=O)Nc1nc2ccc(cc2s1)-c1cnc2[nH]ccc2c1
: