Target
Platelet-derived growth factor receptor alpha
Ligand
BDBM445956
Substrate
Meas. Tech.
PDGFRalpha Kinase Assay
IC50
391±n/a nM
Citation
 Lee, JJo, SLee, GLim, KPark, AYLi, WFan, M Benzothiazol compounds and methods using the same for treating neurodegenerative disorders US Patent  US10669246 Publication Date 6/2/2020 
Target
Name:
Platelet-derived growth factor receptor alpha
Synonyms:
Alpha-type platelet-derived growth factor receptor PDGFRA PGFRA_HUMAN Platelet-derived growth factor receptor alpha (PDGFRA) RHEPDGFRA
Type:
Protein
Mol. Mass.:
122633.38
Organism:
Homo sapiens (Human)
Description:
P16234
Residue:
1089
  
Inhibitor
Name:
BDBM445956
Synonyms:
US10669246, Example 8 | US10968188, Example 8
Type:
Small organic molecule
Emp. Form.:
C17H13F2N3OS
Mol. Mass.:
345.366
SMILES:
Cc1c(F)cncc1-c1ccc2nc(NC(=O)[C@@H]3C[C@@H]3F)sc2c1
: