Target
Tyrosine-protein kinase ABL1
Ligand
BDBM445983
Substrate
Meas. Tech.
c-abl Kinase Assay
IC50
11.4±n/a nM
Citation
 Lee, JJo, SLee, GLim, KPark, AYLi, WFan, M Benzothiazol compounds and methods using the same for treating neurodegenerative disorders US Patent  US10669246 Publication Date 6/2/2020 
Target
Name:
Tyrosine-protein kinase ABL1
Synonyms:
ABL ABL1_HUMAN JTK7 Proto-oncogene tyrosine-protein kinase ABL1 Tyrosine-protein kinase ABL V-abl Abelson murine leukemia viral oncogene homolog 1 p150 | tyrosine-protein kinase ABL1 isoform a
Type:
Enzyme
Mol. Mass.:
122897.30
Organism:
Homo sapiens (Human)
Description:
P00519
Residue:
1130
  
Inhibitor
Name:
BDBM445983
Synonyms:
US10669246, Example 36 | US10968188, Example 36
Type:
Small organic molecule
Emp. Form.:
C17H13F2N3OS
Mol. Mass.:
345.366
SMILES:
Cc1ccncc1-c1ccc2nc(NC(=O)C3CC3(F)F)sc2c1
: