Target
Vascular endothelial growth factor receptor 2
Ligand
BDBM363197
Substrate
Meas. Tech.
VEGFR2 Kinase Assay
IC50
8.00±n/a nM
Citation
 Boral, SMalone, TCWang, S Pyridyl benzothiophenes as kinase inhibitors US Patent  US10669265 Publication Date 6/2/2020 
Target
Name:
Vascular endothelial growth factor receptor 2
Synonyms:
CD_antigen=CD309 Fetal liver kinase 1 (FLK-1) KDR Protein-tyrosine kinase receptor Flk-1 VEGFR-2 VEGFR2 Vascular Endothelial Growth Factor Receptor Kinase 2 Vascular endothelial growth factor receptor 2 (KDR) Vascular endothelial growth factor receptor 2 (VEGFR2) Vascular endothelial growth factor receptor-2 (VEGFR-2)
Type:
Receptor Tyrosine Kinase
Mol. Mass.:
151510.97
Organism:
Homo sapiens (Human)
Description:
P35968
Residue:
1356
  
Inhibitor
Name:
BDBM363197
Synonyms:
6-amino-N-[dimethyl(oxido)- lambda4-sulfanylidene]-5-[5-({[(3- methylphenyl)amino]carbonyl} amino)-1-benzothien-2- yl]nicotinamide US10669265, Example 1 | US9868726, Example 1
Type:
Small organic molecule
Emp. Form.:
C24H23N5O3S2
Mol. Mass.:
493.601
SMILES:
Cc1cccc(NC(=O)Nc2ccc3sc(cc3c2)-c2cc(cnc2N)C(=O)N=S(C)(C)=O)c1
: