Target
Vascular endothelial growth factor receptor 2
Ligand
BDBM364977
Substrate
Meas. Tech.
VEGFR2 Kinase Assay
IC50
42.0±n/a nM
Citation
 Boral, SMalone, TCWang, S Pyridyl benzothiophenes as kinase inhibitors US Patent  US10669265 Publication Date 6/2/2020 
Target
Name:
Vascular endothelial growth factor receptor 2
Synonyms:
CD_antigen=CD309 Fetal liver kinase 1 (FLK-1) KDR Protein-tyrosine kinase receptor Flk-1 VEGFR-2 VEGFR2 Vascular Endothelial Growth Factor Receptor Kinase 2 Vascular endothelial growth factor receptor 2 (KDR) Vascular endothelial growth factor receptor 2 (VEGFR2) Vascular endothelial growth factor receptor-2 (VEGFR-2)
Type:
Receptor Tyrosine Kinase
Mol. Mass.:
151510.97
Organism:
Homo sapiens (Human)
Description:
P35968
Residue:
1356
  
Inhibitor
Name:
BDBM364977
Synonyms:
6-amino-5-{5- [(anilinocarbonyl)amino]-1- benzothien-2-yl}-N- [dimethyl(oxido)-lambda4- sulfanylidene]nicotinamide US10669265, Example 4 | US9868726, Example 4
Type:
Small organic molecule
Emp. Form.:
C23H21N5O3S2
Mol. Mass.:
479.575
SMILES:
CS(C)(=O)=NC(=O)c1cnc(N)c(c1)-c1cc2cc(NC(=O)Nc3ccccc3)ccc2s1
: