Target
Platelet-derived growth factor receptor beta
Ligand
BDBM364980
Substrate
Meas. Tech.
PDGFRbeta Kinase Assay
IC50
21.0±n/a nM
Citation
 Boral, SMalone, TCWang, S Pyridyl benzothiophenes as kinase inhibitors US Patent  US10669265 Publication Date 6/2/2020 
Target
Name:
Platelet-derived growth factor receptor beta
Synonyms:
Beta-type platelet-derived growth factor receptor CD140b antigen PDGF Receptor Substrate PDGFR PDGFR-1 PDGFRB PGFRB_HUMAN Platelet-derived growth factor receptor 1 Platelet-derived growth factor receptor beta (PDGFR-beta) Platelet-derived growth factor receptor beta (PDGFRbeta) | VHL/PDGFRB
Type:
Enzyme
Mol. Mass.:
123922.25
Organism:
Homo sapiens (Human)
Description:
P09619
Residue:
1106
  
Inhibitor
Name:
BDBM364980
Synonyms:
6-amino-5-{5-[({[4-chloro-3- (trifluoromethyl)phenyl]amino} carbonyl)amino]-1- benzothien-2-yl}-N- [dimethyl(oxido)-lambda4- sulfanylidene]nicotinamide US10669265, Example 5 | US9868726, Example 5
Type:
Small organic molecule
Emp. Form.:
C24H19ClF3N5O3S2
Mol. Mass.:
582.018
SMILES:
CS(C)(=O)=NC(=O)c1cnc(N)c(c1)-c1cc2cc(NC(=O)Nc3ccc(Cl)c(c3)C(F)(F)F)ccc2s1
: