Target
Vascular endothelial growth factor receptor 2
Ligand
BDBM365358
Substrate
Meas. Tech.
VEGFR2 Kinase Assay
IC50
206±n/a nM
Citation
 Boral, SMalone, TCWang, S Pyridyl benzothiophenes as kinase inhibitors US Patent  US10669265 Publication Date 6/2/2020 
Target
Name:
Vascular endothelial growth factor receptor 2
Synonyms:
CD_antigen=CD309 Fetal liver kinase 1 (FLK-1) KDR Protein-tyrosine kinase receptor Flk-1 VEGFR-2 VEGFR2 Vascular Endothelial Growth Factor Receptor Kinase 2 Vascular endothelial growth factor receptor 2 (KDR) Vascular endothelial growth factor receptor 2 (VEGFR2) Vascular endothelial growth factor receptor-2 (VEGFR-2)
Type:
Receptor Tyrosine Kinase
Mol. Mass.:
151510.97
Organism:
Homo sapiens (Human)
Description:
P35968
Residue:
1356
  
Inhibitor
Name:
BDBM365358
Synonyms:
1-{4-[2-amino-5-(4,4,5,5- tetramethyl-1,3,2- dioxaborolan-2-yl)pyridin-3- yl]phenyl}-3-phenylurea US10669265, Example 63 | US9868726, Example 63
Type:
Small organic molecule
Emp. Form.:
C24H27BN4O3
Mol. Mass.:
430.307
SMILES:
CC1(C)OB(OC1(C)C)c1cnc(N)c(c1)-c1ccc(NC(=O)Nc2ccccc2)cc1
: