Target
Vascular endothelial growth factor receptor 2
Ligand
BDBM365363
Substrate
Meas. Tech.
VEGFR2 Kinase Assay
IC50
891±n/a nM
Citation
 Boral, SMalone, TCWang, S Pyridyl benzothiophenes as kinase inhibitors US Patent  US10669265 Publication Date 6/2/2020 
Target
Name:
Vascular endothelial growth factor receptor 2
Synonyms:
CD_antigen=CD309 Fetal liver kinase 1 (FLK-1) KDR Protein-tyrosine kinase receptor Flk-1 VEGFR-2 VEGFR2 Vascular Endothelial Growth Factor Receptor Kinase 2 Vascular endothelial growth factor receptor 2 (KDR) Vascular endothelial growth factor receptor 2 (VEGFR2) Vascular endothelial growth factor receptor-2 (VEGFR-2)
Type:
Receptor Tyrosine Kinase
Mol. Mass.:
151510.97
Organism:
Homo sapiens (Human)
Description:
P35968
Residue:
1356
  
Inhibitor
Name:
BDBM365363
Synonyms:
US10633373, Example 68 US9868726, Example 68 | dimethyl (6-amino-5-{4- [(phenylcarbamoyl)amino]phenyl} pyridin-3-yl)phosphonate
Type:
Small organic molecule
Emp. Form.:
C20H21N4O4P
Mol. Mass.:
412.3789
SMILES:
COP(=O)(OC)c1cnc(N)c(c1)-c1ccc(NC(=O)Nc2ccccc2)cc1
: