Target
Vascular endothelial growth factor receptor 2
Ligand
BDBM365370
Substrate
Meas. Tech.
VEGFR2 Kinase Assay
IC50
7.00±n/a nM
Citation
 Boral, SMalone, TCWang, S Pyridyl benzothiophenes as kinase inhibitors US Patent  US10669265 Publication Date 6/2/2020 
Target
Name:
Vascular endothelial growth factor receptor 2
Synonyms:
CD_antigen=CD309 Fetal liver kinase 1 (FLK-1) KDR Protein-tyrosine kinase receptor Flk-1 VEGFR-2 VEGFR2 Vascular Endothelial Growth Factor Receptor Kinase 2 Vascular endothelial growth factor receptor 2 (KDR) Vascular endothelial growth factor receptor 2 (VEGFR2) Vascular endothelial growth factor receptor-2 (VEGFR-2)
Type:
Receptor Tyrosine Kinase
Mol. Mass.:
151510.97
Organism:
Homo sapiens (Human)
Description:
P35968
Residue:
1356
  
Inhibitor
Name:
BDBM365370
Synonyms:
US10633373, Example 75 US9868726, Example 75 | methyl 6-amino-5-[4-({[4- chloro-3- (trifluoromethyl)phenyl]carbamoyl} amino)phenyl]pyridine- 3-carboxylate
Type:
Small organic molecule
Emp. Form.:
C21H16ClF3N4O3
Mol. Mass.:
464.825
SMILES:
COC(=O)c1cnc(N)c(c1)-c1ccc(NC(=O)Nc2ccc(Cl)c(c2)C(F)(F)F)cc1
: