Target
Ataxin-1
Ligand
BDBM446232
Substrate
Meas. Tech.
Human ATX Enzyme Inhibition Assay
IC50
2.00±n/a nM
Citation
 Hert, JHunziker, DMattei, PMauser, HTang, GWang, L Bicyclic derivatives US Patent  US10669268 Publication Date 6/2/2020 
Target
Name:
Ataxin-1
Synonyms:
ATX1 ATXN1 | SCA1
Type:
Protein
Mol. Mass.:
86941.25
Organism:
Homo sapiens (Human)
Description:
P54253
Residue:
815
  
Inhibitor
Name:
BDBM446232
Synonyms:
US10669268, Example 15.27
Type:
Small organic molecule
Emp. Form.:
C24H23Cl2N5O2
Mol. Mass.:
484.378
SMILES:
Clc1cc(Cl)cc(\C=C\C(=O)N2CC[C@@H]3CN(C[C@@H]3CC2)C(=O)c2ccc3[nH]nnc3c2)c1
: