Target
Nuclear factor NF-kappa-B p105 subunit
Ligand
BDBM446453
Substrate
Meas. Tech.
Nuclear Factor of Activated T-Cells (NFAT) Assay
EC50
55±n/a nM
Citation
 Wu, LLi, JYao, W Heterocyclic compounds as immunomodulators US Patent  US10669271 Publication Date 6/2/2020 
Target
Name:
Nuclear factor NF-kappa-B p105 subunit
Synonyms:
NFKB1 Nuclear factor NF-kappa-B (NF-kB) Nuclear factor NF-kappa-B p105 subunit
Type:
Protein
Mol. Mass.:
105329.57
Organism:
Homo sapiens (Human)
Description:
P19838
Residue:
968
  
Inhibitor
Name:
BDBM446453
Synonyms:
(R)-1-((7-cyano-2-(3′-(7-(((R)-3-hydroxypyrrolidin-1-yl)methyl)-2-methylpyrido[3,2-d]pyrimidin-4-ylamino)-2,2′-dimethylbiphenyl-3-yl)benzo[d]oxazol-5-yl)methyl)pyrrolidine-3-carboxylic Acid US10669271, Example 6 | US11124511, Example 6
Type:
Small organic molecule
Emp. Form.:
C41H40N8O4
Mol. Mass.:
708.8075
SMILES:
Cc1nc(Nc2cccc(c2C)-c2cccc(-c3nc4cc(CN5CC[C@H](C5)C(O)=O)cc(C#N)c4o3)c2C)c2ncc(CN3CC[C@@H](O)C3)cc2n1
: