Target
Nuclear factor NF-kappa-B p105 subunit
Ligand
BDBM446479
Substrate
Meas. Tech.
Nuclear Factor of Activated T-Cells (NFAT) Assay
EC50
55±n/a nM
Citation
 Wu, LLi, JYao, W Heterocyclic compounds as immunomodulators US Patent  US10669271 Publication Date 6/2/2020 
Target
Name:
Nuclear factor NF-kappa-B p105 subunit
Synonyms:
NFKB1 Nuclear factor NF-kappa-B (NF-kB) Nuclear factor NF-kappa-B p105 subunit
Type:
Protein
Mol. Mass.:
105329.57
Organism:
Homo sapiens (Human)
Description:
P19838
Residue:
968
  
Inhibitor
Name:
BDBM446479
Synonyms:
(R)-1-((7-cyano-2-(3′-(2-(hydroxymethyl)-7-((3-hydroxypyrrolidin-1-yl)methyl)pyrido[3,2-d]pyrimidin-4-ylamino)-2,2′-dimethylbiphenyl-3-yl)benzo[d]oxazol-5-yl)methyl)piperidine-4-carboxylic Acid US11124511, Example 32
Type:
Small organic molecule
Emp. Form.:
C42H42N8O5
Mol. Mass.:
738.8335
SMILES:
Cc1c(Nc2nc(CO)nc3cc(CN4CC[C@@H](O)C4)cnc23)cccc1-c1cccc(-c2nc3cc(CN4CCC(CC4)C(O)=O)cc(C#N)c3o2)c1C
: