Target
Amyloid-beta precursor protein [672-713]
Ligand
BDBM446533
Substrate
Meas. Tech.
gamma-Secretase Assay
EC50
8.00±n/a nM
Citation
 Bartels, BJakob-Roetne, RLimberg, ANeidhart, WRatni, HSteiner, SReutlinger, M Fused pyrimidine derivatives US Patent  US10669276 Publication Date 6/2/2020 
Target
Name:
Amyloid-beta precursor protein [672-713]
Synonyms:
A4 AD1 Amyloid-beta precursor protein aa 672-713 | Amyloid-beta protein 42
Type:
Enzyme Catalytic Domain
Mol. Mass.:
4512.53
Organism:
Homo sapiens (Human)
Description:
P05067[672-713]
Residue:
42
  
Inhibitor
Name:
BDBM446533
Synonyms:
N2-(6-(4-Chloro-1H-imidazol-1-yl)-5-methoxypyridin-3-yl)-7-(2,4-difluorophenyl)-N4,5,5-trimethyl-6,7-dihydro-5H-pyrrolo[2,3-d]pyrimidine-2,4-diamine | US10669276, Example 23
Type:
Small organic molecule
Emp. Form.:
C24H23ClF2N8O
Mol. Mass.:
512.942
SMILES:
CNc1nc(Nc2cnc(c(OC)c2)-n2cnc(Cl)c2)nc2N(CC(C)(C)c12)c1ccc(F)cc1F
: