Target
cAMP-specific 3',5'-cyclic phosphodiesterase 4C
Ligand
BDBM285598
Substrate
Meas. Tech.
Biological Assays
IC50
2.00±n/a nM
Citation
 Chappie, TAPatel, NCHayward, MMHelal, CJSciabola, SLaChapelle, EAYoung, JMVerhoest, PR Imidazopyridazine compounds US Patent  US10669279 Publication Date 6/2/2020 
Target
Name:
cAMP-specific 3',5'-cyclic phosphodiesterase 4C
Synonyms:
3',5'-cyclic phosphodiesterase NP_000914.2 PDE4C | PDE4C1
Type:
Enzyme Catalytic Domain
Mol. Mass.:
79875.54
Organism:
Homo sapiens (Human)
Description:
Q08493
Residue:
712
  
Inhibitor
Name:
BDBM285598
Synonyms:
3-(3-chloro-4-methylphenyl)-N-[(1R,2S)-2-fluorocyclopro-pyl]imidazo[1,2-b]pyridazine-2-carboxamide US10669279, Example 71 | US9598421, Example 71
Type:
Small organic molecule
Emp. Form.:
C17H14ClFN4O
Mol. Mass.:
344.771
SMILES:
Cc1ccc(cc1Cl)-c1c(nc2cccnn12)C(=O)N[C@@H]1C[C@@H]1F
: