Target
Ataxin-1
Ligand
BDBM446576
Substrate
Meas. Tech.
Human ATX Enzyme Inhibition Assay
IC50
16.0±n/a nM
Citation
 Hunziker, DHert, JKuehne, HMattei, PRudolph, M Condensed [1,4] diazepine compounds as autotaxin (ATX) and lysophosphatidic acid (LPA) production inhibitors US Patent  US10669285 Publication Date 6/2/2020 
Target
Name:
Ataxin-1
Synonyms:
ATX1 ATXN1 | SCA1
Type:
Protein
Mol. Mass.:
86941.25
Organism:
Homo sapiens (Human)
Description:
P54253
Residue:
815
  
Inhibitor
Name:
BDBM446576
Synonyms:
3-[4-(difluoromethoxy)-3-fluorophenyl]-1-[2-(1,4,6,7-tetrahydrotriazolo[4,5-c]pyridine-5-carbonyl)-4,5,7,8-tetrahydropyrazolo[1,5-d][1,4]diazepin-6-yl]propan-1-one | US10669285, Example 26
Type:
Small organic molecule
Emp. Form.:
C23H24F3N7O3
Mol. Mass.:
503.477
SMILES:
FC(F)Oc1ccc(CCC(=O)N2CCc3cc(nn3CC2)C(=O)N2CCc3[nH]nnc3C2)cc1F
: