Target
Ataxin-1
Ligand
BDBM446580
Substrate
Meas. Tech.
Human ATX Enzyme Inhibition Assay
IC50
41.0±n/a nM
Citation
 Hunziker, DHert, JKuehne, HMattei, PRudolph, M Condensed [1,4] diazepine compounds as autotaxin (ATX) and lysophosphatidic acid (LPA) production inhibitors US Patent  US10669285 Publication Date 6/2/2020 
Target
Name:
Ataxin-1
Synonyms:
ATX1 ATXN1 | SCA1
Type:
Protein
Mol. Mass.:
86941.25
Organism:
Homo sapiens (Human)
Description:
P54253
Residue:
815
  
Inhibitor
Name:
BDBM446580
Synonyms:
CHEM-US-00093 | US10669285, Example 30
Type:
Small organic molecule
Emp. Form.:
C21H21F2N7O3
Mol. Mass.:
457.4333
SMILES:
Fc1ccc(COC(=O)N2CCc3cc(nn3CC2)C(=O)N2CCc3[nH]nnc3C2)cc1F
: