Target
Ataxin-1
Ligand
BDBM446586
Substrate
Meas. Tech.
Human ATX Enzyme Inhibition Assay
IC50
6.00±n/a nM
Citation
 Hunziker, DHert, JKuehne, HMattei, PRudolph, M Condensed [1,4] diazepine compounds as autotaxin (ATX) and lysophosphatidic acid (LPA) production inhibitors US Patent  US10669285 Publication Date 6/2/2020 
Target
Name:
Ataxin-1
Synonyms:
ATX1 ATXN1 | SCA1
Type:
Protein
Mol. Mass.:
86941.25
Organism:
Homo sapiens (Human)
Description:
P54253
Residue:
815
  
Inhibitor
Name:
BDBM446586
Synonyms:
CHEM-US-00099 | US10669285, Example 36
Type:
Small organic molecule
Emp. Form.:
C21H20F4N8O4
Mol. Mass.:
524.4283
SMILES:
Fc1cc(COC(=O)N2CCc3nc(nn3CC2)C(=O)N2CCc3[nH]nnc3C2)ccc1OC(F)(F)F
: