Target
Prolyl endopeptidase
Ligand
BDBM298373
Substrate
Meas. Tech.
POP Inhibition Assays
IC50
5.00±1.6 nM
Citation
 Giralt Lledó, ETarragó Clua, TPrades Cosano, RRoyo Gracia, S 1- [1-(benzoyl)-pyrrolidine-2-carbonyl]-pyrrolidine-2-carbonitrile derivatives US Patent  US10125097 Publication Date 11/13/2018 
Target
Name:
Prolyl endopeptidase
Synonyms:
PE POP PREP Prolyl oligopeptidase
Type:
Enzyme
Mol. Mass.:
80688.50
Organism:
Homo sapiens (Human)
Description:
P48147
Residue:
710
  
Inhibitor
Name:
BDBM298373
Synonyms:
(S)-1-((S)-1-(4-(benzyloxy)-3-fluorobenzoyl)-4,4-difluoropyrrolidine-2-carbonyl)pyrrolidine-2-carbonitrile US10611727, Example 21
Type:
Small organic molecule
Emp. Form.:
C24H22F3N3O3
Mol. Mass.:
457.445
SMILES:
Fc1cc(ccc1OCc1ccccc1)C(=O)N1CC(F)(F)C[C@H]1C(=O)N1CCC[C@H]1C#N
: