Target
Proteasome subunit beta type-8
Ligand
BDBM446654
Substrate
Meas. Tech.
Determination of LMP7 Activity
IC50
<50±n/a nM
Citation
 Klein, MSchadt, OHaselmayer, PKrier, M Boronic acid derivatives US Patent  US10669289 Publication Date 6/2/2020 
Target
Name:
Proteasome subunit beta type-8
Synonyms:
26S proteosome Low molecular mass protein 7 Multicatalytic endopeptidase complex subunit C13 PSMB5i Proteasome component C13 Proteasome subunit beta-5i Y2
Type:
PROTEIN
Mol. Mass.:
30357.49
Organism:
Homo sapiens (Human)
Description:
ChEMBL_1446797
Residue:
276
  
Inhibitor
Name:
BDBM446654
Synonyms:
US10669289, Compound 61
Type:
Small organic molecule
Emp. Form.:
C17H22BF3N2O4
Mol. Mass.:
386.174
SMILES:
Cc1ccc(C[C@H](NC(=O)CN(CC(F)(F)F)C(=O)C=C)B(O)O)cc1C
: