Target
Tyrosine-protein kinase Fyn
Ligand
BDBM447181
Substrate
Meas. Tech.
ADP-Glo Kinase Assay
IC50
223±n/a nM
Citation
 Lau, WC Methods, compositions, and uses of novel Fyn kinase inhibitors US Patent  US10688093 Publication Date 6/23/2020 
Target
Name:
Tyrosine-protein kinase Fyn
Synonyms:
FYN Proto-oncogene Syn SLK Src-like kinase | p59-Fyn
Type:
Enzyme
Mol. Mass.:
60762.21
Organism:
Homo sapiens (Human)
Description:
P06241
Residue:
537
  
Inhibitor
Name:
BDBM447181
Synonyms:
3-[3-(4-hydroxy- 3-methoxy- phenyl)imidazo [1,2-b]pyridazin- 6-yl]benzamide US11701353, Compound 828_0314_0347
Type:
Small organic molecule
Emp. Form.:
C20H16N4O3
Mol. Mass.:
360.366
SMILES:
COc1cc(ccc1O)-c1cnc2ccc(nn12)-c1cccc(c1)C(N)=O
: