Target
Tyrosine-protein kinase Fyn
Ligand
BDBM447035
Substrate
Meas. Tech.
ADP-Glo Kinase Assay
IC50
167±n/a nM
Citation
 Lau, WC Methods, compositions, and uses of novel Fyn kinase inhibitors US Patent  US10688093 Publication Date 6/23/2020 
Target
Name:
Tyrosine-protein kinase Fyn
Synonyms:
FYN Proto-oncogene Syn SLK Src-like kinase | p59-Fyn
Type:
Enzyme
Mol. Mass.:
60762.21
Organism:
Homo sapiens (Human)
Description:
P06241
Residue:
537
  
Inhibitor
Name:
BDBM447035
Synonyms:
N-[3-[6-(4- hydroxy-3- methoxy- phenyl)imidazo [1,2-b]pyridazin- 3-yl]phenyl] acetamide US10688093, Compound BF000726183 (828_0081_0314) | US11701353, Compound 828_0081_0314
Type:
Small organic molecule
Emp. Form.:
C21H18N4O3
Mol. Mass.:
374.3926
SMILES:
COc1cc(ccc1O)-c1ccc2ncc(-c3cccc(NC(C)=O)c3)n2n1
: