Target
Tyrosine-protein kinase Fyn
Ligand
BDBM447397
Substrate
Meas. Tech.
ADP-Glo Kinase Assay
IC50
79.4±n/a nM
Citation
 Lau, WC Methods, compositions, and uses of novel Fyn kinase inhibitors US Patent  US10688093 Publication Date 6/23/2020 
Target
Name:
Tyrosine-protein kinase Fyn
Synonyms:
FYN Proto-oncogene Syn SLK Src-like kinase | p59-Fyn
Type:
Enzyme
Mol. Mass.:
60762.21
Organism:
Homo sapiens (Human)
Description:
P06241
Residue:
537
  
Inhibitor
Name:
BDBM447397
Synonyms:
US10688093, Compound BF000817169 | US11701353, Compound BF000817169
Type:
Small organic molecule
Emp. Form.:
C18H14N4O2
Mol. Mass.:
318.3294
SMILES:
COc1cc(ccc1O)-c1cnc2ccc(nn12)-c1ccncc1
: