Target
Proto-oncogene tyrosine-protein kinase ROS [L2026M]
Ligand
BDBM267438
Substrate
Meas. Tech.
Inhibition Kinase Assay
IC50
3980±n/a nM
Citation
 Andrews, SWBlake, JFHaas, JKolakowski, GR Macrocylic compounds as ROS1 kinase inhibitors US Patent  US10688100 Publication Date 6/23/2020 
Target
Name:
Proto-oncogene tyrosine-protein kinase ROS [L2026M]
Synonyms:
MCF3 ROS ROS1_HUMAN
Type:
Enzyme Catalytic Domain
Mol. Mass.:
263915.43
Organism:
Homo sapiens (Human)
Description:
P08922[L2026M]
Residue:
2347
  
Inhibitor
Name:
BDBM267438
Synonyms:
US10688100, Compound 22 US9718822, 22 US9902741, Example 22
Type:
Small organic molecule
Emp. Form.:
C21H22FN5O2
Mol. Mass.:
395.4301
SMILES:
CC(=O)N1CCOc2ccc(F)cc2[C@H]2CCCN2c2ccn3ncc(C1)c3n2
: