Target
Metabotropic glutamate receptor 2
Ligand
BDBM446712
Substrate
Meas. Tech.
GTPγS binding test
IC50
5.22±n/a nM
Citation
 Otake, NHashihayata, TMatsuda, YMasuda, SYamauchi, Y Prodrug amino acid derivative US Patent  US10689327 Publication Date 6/23/2020 
Target
Name:
Metabotropic glutamate receptor 2
Synonyms:
GPRC1B GRM2_HUMAN Metabotropic glutamate receptor mGlu2 | metabotropic glutamate 2
Type:
Enzyme
Mol. Mass.:
95584.88
Organism:
Homo sapiens (Human)
Description:
Q14416
Residue:
872
  
Inhibitor
Name:
BDBM446712
Synonyms:
(1R,2R,3R,5R,6R)-2-amino-6-fluoro-3-[(1R)-1-(4- fluoro-3- methoxyphenyl)ethoxy]bicyclo[3.1.0]hexane-2,6- dicarboxylic acid | US10689327, Compound (II)-4
Type:
Small organic molecule
Emp. Form.:
C17H19F2NO6
Mol. Mass.:
371.3327
SMILES:
COc1cc(ccc1F)[C@@H](C)O[C@@H]1C[C@@H]2[C@@H]([C@@]2(F)C(O)=O)[C@]1(N)C(O)=O
: