Target
Metabotropic glutamate receptor 3
Ligand
BDBM446832
Substrate
Meas. Tech.
GTPγS binding test
IC50
4.35±n/a nM
Citation
 Otake, NHashihayata, TMatsuda, YMasuda, SYamauchi, Y Prodrug amino acid derivative US Patent  US10689327 Publication Date 6/23/2020 
Target
Name:
Metabotropic glutamate receptor 3
Synonyms:
GPRC1C GRM3_HUMAN metabotropic glutamate 3 metabotropic glutamate 3/1c
Type:
Enzyme Catalytic Domain
Mol. Mass.:
98889.09
Organism:
Homo sapiens (Human)
Description:
metabotropic glutamate 1c 0 HUMAN::Q14832
Residue:
879
  
Inhibitor
Name:
BDBM446832
Synonyms:
(1R,2R,3R,5R,6R)-2-amino-6-fluoro-3-[(2-oxo-1,2- dihycropyridin-4-yl)methoxy]bicyclo[3.1.0]hexane- 2.6-dicarboxylic acid | US10689327, Compound (II)-13
Type:
Small organic molecule
Emp. Form.:
C14H15FN2O6
Mol. Mass.:
326.2771
SMILES:
N[C@@]1([C@H]2[C@@H](C[C@H]1OCc1cc[nH]c(=O)c1)[C@]2(F)C(O)=O)C(O)=O
: