Target
Cathepsin S
Ligand
BDBM447340
Substrate
Meas. Tech.
Enzyme Inhibition Assay
IC50
0.560±n/a nM
Citation
 Haap, WKuhn, BLuebbers, TPeters, J Pyrrolidine derivatives US Patent  US10689339 Publication Date 6/23/2020 
Target
Name:
Cathepsin S
Synonyms:
CATS_HUMAN Cathepsin S (Cat S) | cathepsin S preproprotein
Type:
Protein
Mol. Mass.:
37507.38
Organism:
Homo sapiens (Human)
Description:
P25774
Residue:
331
  
Inhibitor
Name:
BDBM447340
Synonyms:
(2S,4R)-4-(2-chloro-4-(2H-1,2,3-triazol-2-yl)phenylsulfonyl)-N-(1-cyanocyclopropyl)-1-(1-(trifluoromethyl)cyclopropanecarbonyl)pyrrolidine-2-carboxamide | US10689339, Example 12
Type:
Small organic molecule
Emp. Form.:
C22H20ClF3N6O4S
Mol. Mass.:
556.945
SMILES:
FC(F)(F)C1(CC1)C(=O)N1C[C@@H](C[C@H]1C(=O)NC1(CC1)C#N)S(=O)(=O)c1ccc(cc1Cl)-n1nccn1
: