Target
Cathepsin S
Ligand
BDBM447419
Substrate
Meas. Tech.
Enzyme Inhibition Assay
IC50
0.558±n/a nM
Citation
 Haap, WKuhn, BLuebbers, TPeters, J Pyrrolidine derivatives US Patent  US10689339 Publication Date 6/23/2020 
Target
Name:
Cathepsin S
Synonyms:
CATS_HUMAN Cathepsin S (Cat S) | cathepsin S preproprotein
Type:
Protein
Mol. Mass.:
37507.38
Organism:
Homo sapiens (Human)
Description:
P25774
Residue:
331
  
Inhibitor
Name:
BDBM447419
Synonyms:
(2S,4R)-4-[4-(3,5-Dimethyl-[1,2,4]triazol-1-yl)-2-trifluoromethyl-benzenesulfonyl]-1-(1-trifluoromethyl-cyclopropanecarbonyl)-pyrrolidine-2-carboxylic acid (1-cyano-cyclopropyl)-amide | US10689339, Example 27
Type:
Small organic molecule
Emp. Form.:
C25H24F6N6O4S
Mol. Mass.:
618.551
SMILES:
Cc1nc(C)n(n1)-c1ccc(c(c1)C(F)(F)F)S(=O)(=O)[C@@H]1C[C@H](N(C1)C(=O)C1(CC1)C(F)(F)F)C(=O)NC1(CC1)C#N
: