Target
Ubiquitin carboxyl-terminal hydrolase 30
Ligand
BDBM404383
Substrate
Meas. Tech.
Biochemical Fluorescence Intensity Kinetic Assay/Biochemical Fluorescence Intensity Assay
IC50
<100±n/a nM
Citation
 Jones, AKemp, MStockley, MGibson, KWhitlock, G 1-cyano-pyrrolidine compounds as USP30 inhibitors US Patent  US10689345 Publication Date 6/23/2020 
Target
Name:
Ubiquitin carboxyl-terminal hydrolase 30
Synonyms:
Deubiquitinating enzyme 30 USP30 Ubiquitin carboxyl-terminal hydrolase 30 (USP30) Ubiquitin-specific-processing protease 30
Type:
Protein
Mol. Mass.:
58522.90
Organism:
Homo sapiens (Human)
Description:
Q70CQ3
Residue:
517
  
Inhibitor
Name:
BDBM404383
Synonyms:
(R)-6-(4-chlorophenyl)-N-(1- cyanopyrrolidin-3-yl)nicotinamide US10689345, Example 36 US11390584, Example 36
Type:
Small organic molecule
Emp. Form.:
C17H15ClN4O
Mol. Mass.:
326.78
SMILES:
Clc1ccc(cc1)-c1ccc(cn1)C(=O)N[C@@H]1CCN(C1)C#N
: