Target
Ubiquitin carboxyl-terminal hydrolase 30
Ligand
BDBM447719
Substrate
Meas. Tech.
Biochemical Fluorescence Intensity Kinetic Assay/Biochemical Fluorescence Intensity Assay
IC50
<100±n/a nM
Citation
 Jones, AKemp, MStockley, MGibson, KWhitlock, G 1-cyano-pyrrolidine compounds as USP30 inhibitors US Patent  US10689345 Publication Date 6/23/2020 
Target
Name:
Ubiquitin carboxyl-terminal hydrolase 30
Synonyms:
Deubiquitinating enzyme 30 USP30 Ubiquitin carboxyl-terminal hydrolase 30 (USP30) Ubiquitin-specific-processing protease 30
Type:
Protein
Mol. Mass.:
58522.90
Organism:
Homo sapiens (Human)
Description:
Q70CQ3
Residue:
517
  
Inhibitor
Name:
BDBM447719
Synonyms:
3-([1,1'-biphenyl]-4-yl)-1-(1- cyanopyrrolidin-3-yl)-1-methylurea US11066365, Example 259
Type:
Small organic molecule
Emp. Form.:
C19H20N4O
Mol. Mass.:
320.3883
SMILES:
CN(C1CCN(C1)C#N)C(=O)Nc1ccc(cc1)-c1ccccc1
: