Target
Plasma kallikrein
Ligand
BDBM416894
Substrate
Meas. Tech.
Activity Assay
Ki
25.1±n/a nM
Citation
 Kotian, PLBabu, YSWu, MChintareddy, VRKumar, VSZhang, W Human plasma kallikrein inhibitors US Patent  US10689346 Publication Date 6/23/2020 
Target
Name:
Plasma kallikrein
Synonyms:
Fletcher factor KLKB1 Kallikrein Plasma kallikrein heavy chain Plasma prekallikrein
Type:
Protein
Mol. Mass.:
71391.16
Organism:
Homo sapiens (Human)
Description:
P03952
Residue:
638
  
Inhibitor
Name:
BDBM416894
Synonyms:
1-(3-(aminomethyl)phenyl)-N-(5-((4-cyanophenyl)(cyclopropylmethoxy)methyl)-2-fluorophenyl)-3-(trifluoromethyl)-1H-pyrazole-5-carboxamide US10633345, Compound 73b US11203574, Compound 73b US11685721, Compound 73b | US11708332, Compound 73b
Type:
Small organic molecule
Emp. Form.:
C30H25F4N5O2
Mol. Mass.:
563.5454
SMILES:
NCc1cccc(c1)-n1nc(cc1C(=O)Nc1cc(ccc1F)C(OCC1CC1)c1ccc(cc1)C#N)C(F)(F)F
: