Target
Plasma kallikrein
Ligand
BDBM416998
Substrate
Meas. Tech.
Activity Assay
Ki
25.1±n/a nM
Citation
 Kotian, PLBabu, YSWu, MChintareddy, VRKumar, VSZhang, W Human plasma kallikrein inhibitors US Patent  US10689346 Publication Date 6/23/2020 
Target
Name:
Plasma kallikrein
Synonyms:
Fletcher factor KLKB1 Kallikrein Plasma kallikrein heavy chain Plasma prekallikrein
Type:
Protein
Mol. Mass.:
71391.16
Organism:
Homo sapiens (Human)
Description:
P03952
Residue:
638
  
Inhibitor
Name:
BDBM416998
Synonyms:
(+)-N-(5-(1-amino-1-(4-cyanophenyl)-3-cyclopropylpropyl)-2-fluorophenyl)-1-(1-aminoisoquinolin-7-yl)-3-(trifluoromethyl)-1H-pyrazole-5-carboxamide US10633345, Compound 254c US11203574, Compound 254c US11685721, Compound 254c | US11708332, Compound 254c
Type:
Small organic molecule
Emp. Form.:
C33H27F4N7O
Mol. Mass.:
613.6074
SMILES:
Nc1nccc2ccc(cc12)-n1nc(cc1C(=O)Nc1cc(ccc1F)C(N)(CCC1CC1)c1ccc(cc1)C#N)C(F)(F)F
: