Target
N-acylethanolamine-hydrolyzing acid amidase
Ligand
BDBM447475
Substrate
Meas. Tech.
Inhibition of Test Compounds NAAA Assay
IC50
550±n/a nM
Citation
 Malamas, MSMakriyannis, AFarah, SIZvonok, AMAlapafuja, SO N-acylethanolamine hydrolyzing acid amidase (NAAA) inhibitors and use thereof US Patent  US10689357 Publication Date 6/23/2020 
Target
Name:
N-acylethanolamine-hydrolyzing acid amidase
Synonyms:
ASAH-like protein Acid ceramidase-like protein N-acylsphingosine amidohydrolase-like NAAA PLT
Type:
Enzyme
Mol. Mass.:
40073.12
Organism:
Homo sapiens (Human)
Description:
Q02083
Residue:
359
  
Inhibitor
Name:
BDBM447475
Synonyms:
US10689357, Example 13
Type:
Small organic molecule
Emp. Form.:
C15H14N2O2S
Mol. Mass.:
286.349
SMILES:
COc1ccc(cc1)C#CC(=O)N[C@H]1C[C@H](C1)N=C=S
: