Target
N-acylethanolamine-hydrolyzing acid amidase
Ligand
BDBM447492
Substrate
Meas. Tech.
Inhibition of Test Compounds NAAA Assay
IC50
55±n/a nM
Citation
 Malamas, MSMakriyannis, AFarah, SIZvonok, AMAlapafuja, SO N-acylethanolamine hydrolyzing acid amidase (NAAA) inhibitors and use thereof US Patent  US10689357 Publication Date 6/23/2020 
Target
Name:
N-acylethanolamine-hydrolyzing acid amidase
Synonyms:
ASAH-like protein Acid ceramidase-like protein N-acylsphingosine amidohydrolase-like NAAA PLT
Type:
Enzyme
Mol. Mass.:
40073.12
Organism:
Homo sapiens (Human)
Description:
Q02083
Residue:
359
  
Inhibitor
Name:
BDBM447492
Synonyms:
US10689357, Example 29
Type:
Small organic molecule
Emp. Form.:
C19H16F2N2O2S
Mol. Mass.:
374.404
SMILES:
COc1ccc(cc1F)-c1ccc(C(=O)N[C@H]2C[C@H](C2)N=C=S)c(F)c1
: