Target
Mast/stem cell growth factor receptor Kit
Ligand
BDBM447641
Substrate
Meas. Tech.
Kinase Assay
Ki
27.5±n/a nM
Citation
 Peng, SLiao, CChen, HHo, CHuang, HChiou, S Quinoxaline compounds as type III receptor tyrosine kinase inhibitors US Patent  US10689362 Publication Date 6/23/2020 
Target
Name:
Mast/stem cell growth factor receptor Kit
Synonyms:
CD117 antigen KIT Mast/stem cell growth factor receptor Kit (cKIT) Proto-oncogene tyrosine-protein kinase Kit Stem cell growth factor receptor Tyrosine-protein kinase Kit c-kit v-kit Hardy-Zuckerman 4 feline sarcoma viral oncogene homolog
Type:
Protein
Mol. Mass.:
109869.37
Organism:
Homo sapiens (Human)
Description:
P10721
Residue:
976
  
Inhibitor
Name:
BDBM447641
Synonyms:
6-((4-((6-cyclopropylpyridin-3-yl)methoxy)-3-methoxy-phenyl)amino)-3-morpholinoquinoxaline-5-carbonitrile | US10689362, Example 120
Type:
Small organic molecule
Emp. Form.:
C29H28N6O3
Mol. Mass.:
508.571
SMILES:
COc1cc(Nc2ccc3ncc(nc3c2C#N)N2CCOCC2)ccc1OCc1ccc(nc1)C1CC1
: