Target
Mast/stem cell growth factor receptor Kit
Ligand
BDBM447666
Substrate
Meas. Tech.
Kinase Assay
Ki
27.5±n/a nM
Citation
 Peng, SLiao, CChen, HHo, CHuang, HChiou, S Quinoxaline compounds as type III receptor tyrosine kinase inhibitors US Patent  US10689362 Publication Date 6/23/2020 
Target
Name:
Mast/stem cell growth factor receptor Kit
Synonyms:
CD117 antigen KIT Mast/stem cell growth factor receptor Kit (cKIT) Proto-oncogene tyrosine-protein kinase Kit Stem cell growth factor receptor Tyrosine-protein kinase Kit c-kit v-kit Hardy-Zuckerman 4 feline sarcoma viral oncogene homolog
Type:
Protein
Mol. Mass.:
109869.37
Organism:
Homo sapiens (Human)
Description:
P10721
Residue:
976
  
Inhibitor
Name:
BDBM447666
Synonyms:
3-(dimethylamino)-6-((3-methoxy-4-((6-methoxypyridin-3-yl)methoxy)phenyl)amino)quinoxaline-5-carbonitrile | US10689362, Example 137
Type:
Small organic molecule
Emp. Form.:
C25H24N6O3
Mol. Mass.:
456.4965
SMILES:
COc1ccc(COc2ccc(Nc3ccc4ncc(nc4c3C#N)N(C)C)cc2OC)cn1
: