Target
Apelin receptor
Ligand
BDBM447758
Substrate
Meas. Tech.
GTPγS Binding
EC50
<1000±n/a nM
Citation
 Chen, YCheng, ACDebenedetto, MVDransfield, PJHarvey, JSHouze, JKhakoo, AYLai, SMa, ZPattaropong, VSwaminath, GKreiman, CMoebius, DCSharma, A Triazole pyridyl compounds as agonists of the APJ receptor US Patent  US10689367 Publication Date 6/23/2020 
Target
Name:
Apelin receptor
Synonyms:
AGTRL1 APJ_HUMAN Angiotensin receptor-like 1 Apelin receptor (APJ) G-protein coupled receptor HG11
Type:
Enzyme Catalytic Domain
Mol. Mass.:
42664.06
Organism:
Homo sapiens (Human)
Description:
P35414
Residue:
380
  
Inhibitor
Name:
BDBM447758
Synonyms:
US10689367, Example 79.0
Type:
Small organic molecule
Emp. Form.:
C20H26ClN7O4S
Mol. Mass.:
495.983
SMILES:
CO[C@@H]([C@H](C)S(=O)(=O)Nc1nnc(-c2cccc(OC)n2)n1CC(C)C)c1ncc(Cl)cn1
: