Target
Apelin receptor
Ligand
BDBM447776
Substrate
Meas. Tech.
GTPγS Binding
EC50
6.20±n/a nM
Citation
 Chen, YCheng, ACDebenedetto, MVDransfield, PJHarvey, JSHouze, JKhakoo, AYLai, SMa, ZPattaropong, VSwaminath, GKreiman, CMoebius, DCSharma, A Triazole pyridyl compounds as agonists of the APJ receptor US Patent  US10689367 Publication Date 6/23/2020 
Target
Name:
Apelin receptor
Synonyms:
AGTRL1 APJ_HUMAN Angiotensin receptor-like 1 Apelin receptor (APJ) G-protein coupled receptor HG11
Type:
Enzyme Catalytic Domain
Mol. Mass.:
42664.06
Organism:
Homo sapiens (Human)
Description:
P35414
Residue:
380
  
Inhibitor
Name:
BDBM447776
Synonyms:
US10689367, Example 98.0
Type:
Small organic molecule
Emp. Form.:
C22H31N7O5S
Mol. Mass.:
505.59
SMILES:
COCC(COC)n1c(NS(=O)(=O)[C@@H](C)[C@H](C)c2ncc(C)cn2)nnc1-c1cccc(OC)n1
: